Home > Undeclared Identifier > Error C2065 Iter : Undeclared Identifier

Error C2065 Iter : Undeclared Identifier

Contents

I've added my compiler errors to the questions. If you want to get involved, click one of these buttons! [email protected] Reply | Threaded Open this post in threaded view ♦ ♦ | Report Content as Inappropriate ♦ ♦ Re: Visual Studio 2010 compile error In reply to this post See Debug Iterator Support for more information.You may be calling a function in an SDK header file that is currently not supported in your build environment.Omitting necessary include files, especially if http://gigyahosting1.com/undeclared-identifier/error-c2065-lpw-undeclared-identifier.php

Note: C++ does not support default-int c:\users\admin\documents\visual studio 2008\projects\alg\bfs\bfs\bfs.cpp(86) : warning C4183: 'getVertices': missing return type; assumed to be a member function returning 'int' c:\users\admin\documents\visual studio 2008\projects\alg\bfs\bfs\bfs.cpp(89) : error C2146: syntax Then after it got a refactoring, it seemed to include a "stdafx.h", so I figured I'll download Visual C++ 2008 Express but I can't seem to get it to build. It looks like you're new here. Note: C++ does not support default-int Source\tokens.cpp(335) : error C4430: missing type specifier - int assumed.

Error C2065 Undeclared Identifier

Categories 141.9K All Categories104.8K Programming Languages 6.4K Assembler Developer 1.9K Basic 39.9K C and C++ 4.3K C# 7.9K Delphi and Kylix 4 Haskell 9.6K Java 4.1K Pascal 1.3K Perl 2K PHP Browse more C / C++ Questions on Bytes Question stats viewed: 2754 replies: 3 date asked: Jul 22 '05 Follow this discussion BYTES.COM © 2016 Formerly "TheScripts.com" from 2005-2008 About Bytes This error is with the code exactly as shown below: Error 4 error C4430: missing type specifier - int assumed. Compiler Error C2065 Visual Studio 2015 Other Versions Visual Studio 2013 Visual Studio 2012 Visual Studio 2010 Visual Studio 2008 Visual Studio 2005 Visual Studio .NET 2003 В 'identifier' : undeclared identifierA

Similar topics Undeclared Identifier, Only found solutions, not reasons Undeclared identifier Visual C++ 6.0 Undeclared Identifier Error identifier not found error, undeclared identifier Undeclared Identifier error #C2065 BUG: CFrameWnd::OnDDEExecute MFC 7.1 share|improve this answer answered Jul 19 '09 at 20:09 Sam Harwell 69.4k9137209 add a comment| up vote 0 down vote Perhaps try: #include // note angle brackets This is different On Mon, Apr 19, 2010 at 5:32 PM, Sodan <[hidden email]> wrote: > > found this link > http://programming.itags.org/c-c++/195297/> > says "Because back_inserter_iterator<> is an output iterator but not an > Error C2065 Undeclared Identifier Visual C++ Note: C++ does not support default-int 1>c:\users\виталий\documents\visual studio 2010\projects\baza1\baza1\baza1.cpp(25): error C2371: 'std::cin' : redefinition; different basic types 1> c:\program files\microsoft visual studio 10.0\vc\include\iostream(25) : see declaration of 'std::cin' 1>c:\users\виталий\documents\visual studio 2010\projects\baza1\baza1\baza1.cpp(26):

I installed all that was required (python 2.7.6, scons 2.3.0, wxWidgets 2.8.12) and I am using Microsoft Visual Studio 2008 as a compiler under Windows Server 2003. Undeclared Identifier In C++ Regards Tim. What happens if BB-8 rolls the wrong way? http://thewinwiki.org/error-c2065-iter-undeclared-identifier/ Developer Network Developer Network Developer Sign in MSDN subscriptions Get tools Downloads Visual Studio MSDN subscription access SDKs Trial software Free downloads Office resources SharePoint Server 2013 resources SQL Server 2014

Dev centers Windows Office Visual Studio Microsoft Azure More... C++ Undeclared Identifier Class Wait 3. Regards Tim Bish On Sun, Apr 18, 2010 at 6:30 PM, Sodan <[hidden email]> wrote: > > 1> BooleanStream.cpp > 1>..\src\main\activemq\wireformat\openwire\utils\BooleanStream.cpp(134): > error C2039: 'back_insert_iterator' : is not a member of I'd look for a setting that affect STL compatibility.

  1. Is it bad to port forward port 443 for ssh?
  2. So it should be .h.
  3. And suppose I have a very simple class that only has setters and getters.
  4. contact us Compile Error Main.cpp Main.cpp(19) : error C2065: 'map' : undeclared identifier Main.cpp(19) : error C2062: type 'int' unexpected Main.cpp(20) : error C2065: 'map' : undeclared identifier Main.cpp(20) : error
  5. On what operating system?
  6. When the same project is compiled under GCC, GCC won't know where the file is if it's in another folder.
  7. Jul 22 '05 #3 P: n/a Thomas Matthews msalters wrote: Saurabh Aggrawal wrote:Hi,if (iter->m_name.compare(pstrName) == 0){// Provide our object.*ppunkItem = iter->m_pUnknown;// Addref our object...iter->m_pUnknown->AddRef();break;}else{_asm NOP;}I am getting the errors:abc.cpp(223) : error
  8. Note: C++ does not support default-int c:\users\admin\documents\visual studio 2008\projects\alg\bfs\bfs\bfs.cpp(8) : error C2238: unexpected token(s) preceding ';' c:\users\admin\documents\visual studio 2008\projects\alg\bfs\bfs\bfs.cpp(25) : error C4430: missing type specifier - int assumed.
  9. cant compile the project... > > help! > > SГёren > > > > > Sodan wrote: > > > > 1> BooleanStream.cpp > > 1>..\src\main\activemq\wireformat\openwire\utils\BooleanStream.cpp(134): > > error C2039: 'back_insert_iterator'
  10. Note: C++ does not support default-int 1>c:\users\виталий\documents\visual studio 2010\projects\baza1\baza1\baza1.cpp(22): error C2371: 'std::cin' : redefinition; different basic types 1> c:\program files\microsoft visual studio 10.0\vc\include\iostream(25) : see declaration of 'std::cin' 1>c:\users\виталий\documents\visual studio 2010\projects\baza1\baza1\baza1.cpp(23):

Undeclared Identifier In C++

Check you paths, you may not have them set correctly. For more information, see Generic Functions (C++/CLI).The following sample generates C2065 and shows how to fix it. Error C2065 Undeclared Identifier The content you requested has been removed. C2065 'cout' Undeclared Identifier more stack exchange communities company blog Stack Exchange Inbox Reputation and Badges sign up log in tour help Tour Start here for a quick overview of the site Help Center Detailed

Note: C++ does not support default-int c:\users\admin\documents\visual studio 2008\projects\alg\bfs\bfs\bfs.cpp(43) : error C2758: 'Graph::Vertices' : must be initialized in constructor base/member initializer list c:\users\admin\documents\visual studio 2008\projects\alg\bfs\bfs\bfs.cpp(83) : see declaration of 'Graph::Vertices' c:\users\admin\documents\visual check over here If your main.cpp isn't using those classes, it will not need to include the header. I'm trying to build unicode nsis 2.46.5 from source. I guess the C++ equivalent would be a semicolon by itself. Undeclared Identifier Clang

Note: C++ does not support default-int Source\tokens.cpp(348) : error C2143: syntax error : missing ';' before '&' Source\tokens.cpp(348) : error C2086: 'const int TokenMap' : redefinition Source\tokens.cpp(335) : see declaration of Note: C++ does not support default-int 1>c:\users\виталий\documents\visual studio 2010\projects\baza1\baza1\baza1.cpp(26): error C2371: 'std::cout' : redefinition; different basic types 1> c:\program files\microsoft visual studio 10.0\vc\include\iostream(26) : see declaration of 'std::cout' 1>c:\users\виталий\documents\visual studio 2010\projects\baza1\baza1\baza1.cpp(27): To me, the benefits of separating out the implementation from the declaration outweigh any advantages of keeping them all in the header file, so I would separate them out into .h his comment is here You'll have to set the include path of the project appropriately so each preprocessor-related #include can find the proper file.

iter->m_pUnknown->AddRef(); break; } else { _asm NOP; } I am getting the errors: abc.cpp(223) : error C2065: '_asm' : undeclared identifier abc.cpp(223) : error C2146: syntax error : missing ';' before Afxambientactctx Undeclared Identifier You have using namespace std; try NOT to do this, it pollutes the global namespace with untold stuff from std, and can cause naming conflicts - which is what we are Learning resources Microsoft Virtual Academy Channel 9 MSDN Magazine Community Forums Blogs Codeplex Support Self support Programs BizSpark (for startups) Microsoft Imagine (for students) United States (English) Newsletter Privacy & cookies

cant compile the project...

Define the functions for your classes in the .cpp file by making use of the scope resolution operator :: For example : 1
2
3
int Block::GetColor() { return m_Color; } The main.cpp Not the answer you're looking for? Copy // C2065_b.cpp // compile with: /clr generic void G(int i) {} int main() { // global generic function call G(10); // C2065 G(10); // OK - fix with Undeclared Identifier In Visual C++ With the functions in main, could they be moved into a relevant class?

Terms Privacy Security Status Help You can't perform that action at this time. Note: C++ does not support default-int c:\users\admin\documents\visual studio 2008\projects\alg\bfs\bfs\bfs.cpp(89) : error C4430: missing type specifier - int assumed. Is there an elegant way to prove a function is linear? weblink Thanks a lot!

I guess the C++ equivalent would be a semicolon by itself. Yes No Additional feedback? 1500 characters remaining Submit Skip this Thank you! Note: C++ does not support default-int Source\tokens.cpp(365) : error C2143: syntax error : missing ';' before '&' Source\tokens.cpp(365) : error C2065: 'tokenMap' : undeclared identifier Source\tokens.cpp(366) : error C2825: 'TokenMap': must bfs.cpp c:\users\admin\documents\visual studio 2008\projects\alg\bfs\bfs\bfs.cpp(3) : error C2871: 'std' : a namespace with this name does not exist c:\users\admin\documents\visual studio 2008\projects\alg\bfs\bfs\bfs.cpp(8) : error C2143: syntax error : missing ';' before '<' c:\users\admin\documents\visual

Note: C++ does not support default-int c:\users\admin\documents\visual studio 2008\projects\alg\bfs\bfs\bfs.cpp(38) : error C2039: 'iterator' : is not a member of '`global namespace'' c:\users\admin\documents\visual studio 2008\projects\alg\bfs\bfs\bfs.cpp(38) : error C2238: unexpected token(s) preceding ';' Jul 8, 2013 at 8:26am UTC TheIdeasMan (4958) Just some style points : Organise your code into different files. Note: C++ does not support default-int c:\users\admin\documents\visual studio 2008\projects\alg\bfs\bfs\bfs.cpp(28) : warning C4183: 'getEdges': missing return type; assumed to be a member function returning 'int' c:\users\admin\documents\visual studio 2008\projects\alg\bfs\bfs\bfs.cpp(32) : error C2059: syntax Meaning, are all .cpp files linked together during build or do I still need to include their header on my main one?

Normally, when an include file is located in an unknown folder specified only by a compiler [-I] directive, the include is written as: #include Unfortunately, Visual C++ doesn't let you I tried all possible combinations, I think, and none worked. If not, should I opt for a .cpp file or a .h? Sign in to comment Contact GitHub API Training Shop Blog About © 2016 GitHub, Inc.

help! You signed out in another tab or window. I think everything should be working, but I am getting some very weird, cryptic compiler/linker errors. Why are Car Batteries still so heavy?

This means that it will need to include the header file that contains that definition. We appreciate your feedback. Note: C++ does not support default-int 1>c:\users\виталий\documents\visual studio 2010\projects\baza1\baza1\baza1.cpp(24): error C2371: 'std::cout' : redefinition; different basic types 1> c:\program files\microsoft visual studio 10.0\vc\include\iostream(26) : see declaration of 'std::cout' 1>c:\users\виталий\documents\visual studio 2010\projects\baza1\baza1\baza1.cpp(25): About having a .cpp file for each class, I don't need to do anything else, right?

Serious introduction to the chemistry of explosives recommendation How do I get the last lines of dust into the dustpan?